Ticket #3225: compiler_output.txt

File compiler_output.txt, 2.3 KB (added by Jeffrey Hellrung <jhellrung@…>, 13 years ago)

compiler output

Line 
11>------ Build started: Project: test, Configuration: Debug Win32 ------
21>Compiling...
31>main.cpp
41>E:\boost_1_39_0\boost/mpl/begin_end.hpp(35) : error C2903: 'apply' : symbol is neither a class template nor a function template
51> E:\boost_1_39_0\boost/mpl/is_sequence.hpp(94) : see reference to class template instantiation 'boost::mpl::begin<Sequence>' being compiled
61> with
71> [
81> Sequence=vector_type
91> ]
101> .\main.cpp(9) : see reference to class template instantiation 'boost::mpl::is_sequence<T>' being compiled
111> with
121> [
131> T=vector_type
141> ]
151>E:\boost_1_39_0\boost/mpl/begin_end.hpp(35) : error C2027: use of undefined type 'boost::mpl::begin_impl<boost::fusion::fusion_sequence_tag>'
161>E:\boost_1_39_0\boost/mpl/begin_end.hpp(35) : error C2059: syntax error : '<'
171>E:\boost_1_39_0\boost/mpl/begin_end.hpp(35) : error C2039: 'type' : is not a member of '`global namespace''
181>E:\boost_1_39_0\boost/mpl/begin_end.hpp(35) : error C2238: unexpected token(s) preceding ';'
191>E:\boost_1_39_0\boost/mpl/is_sequence.hpp(94) : error C2039: 'type' : is not a member of 'boost::mpl::begin<Sequence>'
201> with
211> [
221> Sequence=vector_type
231> ]
241>E:\boost_1_39_0\boost/mpl/is_sequence.hpp(94) : error C2146: syntax error : missing ',' before identifier 'type'
251>E:\boost_1_39_0\boost/mpl/is_sequence.hpp(94) : error C2065: 'type' : undeclared identifier
261>E:\boost_1_39_0\boost/mpl/is_sequence.hpp(94) : error C3203: 'is_same' : unspecialized class template can't be used as a template argument for template parameter 'T', expected a real type
271>E:\boost_1_39_0\boost/mpl/is_sequence.hpp(94) : error C2955: 'boost::is_same' : use of class template requires template argument list
281> E:\boost_1_39_0\boost/type_traits/is_same.hpp(37) : see declaration of 'boost::is_same'
291>E:\boost_1_39_0\boost/mpl/is_sequence.hpp(95) : error C2955: 'boost::mpl::not_' : use of class template requires template argument list
301> E:\boost_1_39_0\boost/mpl/not.hpp(40) : see declaration of 'boost::mpl::not_'
311>Build log was saved at "file://e:\Include\test\debug\BuildLog.htm"
321>test - 11 error(s), 0 warning(s)
33========== Build: 0 succeeded, 1 failed, 0 up-to-date, 0 skipped ==========